Target
Aurora kinase B
Ligand
BDBM155567
Substrate
Meas. Tech.
Kinase Assay
pH
7.4±n/a
IC50
930±n/a nM
Comments
extracted
Citation
 Sugimoto, TTakahashi, HMitsuya, MMasuko, NSootome, H Piperidine compound or salt thereof US Patent  US9346787 Publication Date 5/24/2016 
Target
Name:
Aurora kinase B
Synonyms:
AIK2 AIM1 ARK2 AURKB_HUMAN Aurora B-INCENP Aurora kinase B (AURKB) STK-1 STK12 Serine/threonine-protein kinase aurora B
Type:
Protein
Mol. Mass.:
39327.72
Organism:
Homo sapiens (Human)
Description:
Q96GD4
Residue:
344
  
Inhibitor
Name:
BDBM155567
Synonyms:
US10092556, Example 11 US9346787, 11
Type:
Small organic molecule
Emp. Form.:
C24H25ClFN5O4
Mol. Mass.:
501.938
SMILES:
COc1ccc(CC2(CCN(CC2)C(=O)c2cccc(Cl)c2F)C(O)=O)nc1Nc1cc(C)[nH]n1
: