Target
Aurora kinase B
Ligand
BDBM155568
Substrate
Meas. Tech.
Kinase Assay
pH
7.4±n/a
IC50
260±n/a nM
Comments
extracted
Citation
 Sugimoto, TTakahashi, HMitsuya, MMasuko, NSootome, H Piperidine compound or salt thereof US Patent  US9346787 Publication Date 5/24/2016 
Target
Name:
Aurora kinase B
Synonyms:
AIK2 AIM1 ARK2 AURKB_HUMAN Aurora B-INCENP Aurora kinase B (AURKB) STK-1 STK12 Serine/threonine-protein kinase aurora B
Type:
Protein
Mol. Mass.:
39327.72
Organism:
Homo sapiens (Human)
Description:
Q96GD4
Residue:
344
  
Inhibitor
Name:
BDBM155568
Synonyms:
US10092556, Example 12 US9346787, 12
Type:
Small organic molecule
Emp. Form.:
C23H22Cl2FN5O3
Mol. Mass.:
506.357
SMILES:
Cc1cc(Nc2nc(CC3(CCN(CC3)C(=O)c3cccc(Cl)c3F)C(O)=O)ccc2Cl)n[nH]1
: