Target
Aurora kinase B
Ligand
BDBM155575
Substrate
Meas. Tech.
Kinase Assay
pH
7.4±n/a
IC50
450±n/a nM
Comments
extracted
Citation
 Sugimoto, TTakahashi, HMitsuya, MMasuko, NSootome, H Piperidine compound or salt thereof US Patent  US9346787 Publication Date 5/24/2016 
Target
Name:
Aurora kinase B
Synonyms:
AIK2 AIM1 ARK2 AURKB_HUMAN Aurora B-INCENP Aurora kinase B (AURKB) STK-1 STK12 Serine/threonine-protein kinase aurora B
Type:
Protein
Mol. Mass.:
39327.72
Organism:
Homo sapiens (Human)
Description:
Q96GD4
Residue:
344
  
Inhibitor
Name:
BDBM155575
Synonyms:
US10092556, Example 28 US9346787, 28
Type:
Small organic molecule
Emp. Form.:
C25H24ClF2N7O2
Mol. Mass.:
527.954
SMILES:
Cc1cc(Nc2nc(CC3(CCN(CC3)C(=O)c3cccc(Cl)c3F)c3nnc(C)o3)ccc2F)n[nH]1
: