Target
Aurora kinase B
Ligand
BDBM50277545
Substrate
Meas. Tech.
Kinase Assay
pH
7.4±n/a
IC50
90±n/a nM
Comments
extracted
Citation
 Sugimoto, TTakahashi, HMitsuya, MMasuko, NSootome, H Piperidine compound or salt thereof US Patent  US9346787 Publication Date 5/24/2016 
Target
Name:
Aurora kinase B
Synonyms:
AIK2 AIM1 ARK2 AURKB_HUMAN Aurora B-INCENP Aurora kinase B (AURKB) STK-1 STK12 Serine/threonine-protein kinase aurora B
Type:
Protein
Mol. Mass.:
39327.72
Organism:
Homo sapiens (Human)
Description:
Q96GD4
Residue:
344
  
Inhibitor
Name:
BDBM50277545
Synonyms:
4-(9-chloro-7-(2-fluoro-6-methoxyphenyl)-5H-benzo[c]pyrimido[4,5-e]azepin-2-ylamino)-2-methoxybenzoic acid CHEMBL483158 US10092556, Example MLN8237 | US9346787, MLN8237
Type:
Small organic molecule
Emp. Form.:
C27H20ClFN4O4
Mol. Mass.:
518.924
SMILES:
COc1cc(Nc2ncc3CN=C(c4cc(Cl)ccc4-c3n2)c2c(F)cccc2OC)ccc1C(O)=O
: