Target
Substance-P receptor
Ligand
BDBM292013
Substrate
Meas. Tech.
BCA Protein Assay
pH
7.4±n/a
Temperature
333.15±n/a K
IC50
2.25±n/a nM
Comments
extracted
Citation
 Shimizu, KMiyagi, TOhno, KUeno, YOnda, YSuzuki, H Carboxymethyl piperidine derivative US Patent  US10100030 Publication Date 10/16/2018 
Target
Name:
Substance-P receptor
Synonyms:
NK-1 receptor NK1 Receptor NK1R_HUMAN Neurokinin-1 (NK-1) SPR TACR1 Tachykinin receptor 1 (NK1) | tachykinin
Type:
G Protein-Coupled Receptor (GPCR)
Mol. Mass.:
46254.43
Organism:
Homo sapiens (Human)
Description:
P25103
Residue:
407
  
Inhibitor
Name:
BDBM292013
Synonyms:
US10100030, Example 8
Type:
Small organic molecule
Emp. Form.:
C34H33F7N4O3
Mol. Mass.:
678.6396
SMILES:
CC(C1CCN(CC1)c1cc(-c2ccc(F)cc2C)c(N(C)C(=O)C(C)(C)c2cc(cc(c2)C(F)(F)F)C(F)(F)F)c(n1)C#N)C(O)=O
: