Target
Cyclin-A2/Cyclin-dependent kinase 2
Ligand
BDBM6301
Substrate
GST-Rb fusion protein
Meas. Tech.
CDKs Assay
IC50
439±n/a nM
Citation
 Toogood, PLHarvey, PJRepine, JTSheehan, DJVanderWel, SNZhou, HKeller, PRMcNamara, DJSherry, DZhu, TBrodfuehrer, JChoi, CBarvian, MRFry, DW Discovery of a potent and selective inhibitor of cyclin-dependent kinase 4/6. J Med Chem 48:2388-406 (2005)  
Target
Name:
Cyclin-A2/Cyclin-dependent kinase 2
Synonyms:
CDK2-CyclinA CDK2/Cyclin A Cyclin A2/dependent kinase 2 Cyclin-Dependent Kinase 2 (CDK2A)
Type:
Protein Complex
Mol. Mass.:
Description:
Cdk2/Cyclin A kinase was purified from insect cells coinfected with Cyclin A/Cdk2 baculovirus.
Components:
This complex has 2 components.
Component 1
Name:
Cyclin-dependent kinase 2
Synonyms:
CDK2 CDK2_HUMAN Cell division protein kinase 2 Protein cereblon/Cyclin-dependent kinase 2 | p33 protein kinase
Type:
Enzyme Subunit
Mol. Mass.:
33938.17
Organism:
Homo sapiens (Human)
Description:
P24941
Residue:
298
  
Component 2
Name:
Cyclin-A2
Synonyms:
CCN1 CCNA1 CCNA2_HUMAN Cyclin-A
Type:
Enzyme Subunit
Mol. Mass.:
48550.19
Organism:
Homo sapiens (Human)
Description:
P20248
Residue:
432
  
Inhibitor
Name:
BDBM6301
Synonyms:
6-bromo-8-cyclopentyl-5-methyl-2-{[4-(piperazin-1-yl)phenyl]amino}-7H,8H-pyrido[2,3-d]pyrimidin-7-one pyrido[2,3-d]pyrimidin-7-one 29
Type:
Small organic molecule
Emp. Form.:
C23H27BrN6O
Mol. Mass.:
483.404
SMILES:
Cc1c(Br)c(=O)n(C2CCCC2)c2nc(Nc3ccc(cc3)N3CCNCC3)ncc12
:
Substrate
Name:
GST-Rb fusion protein
Synonyms:
Glutathione S-transferase (GST)-retinoblastoma (Rb) fusion RB1 Rb | retinoblastoma
Type:
Other Protein Type
Mol. Mass.:
106410.17
Organism:
Homo sapiens (Human)
Description:
GST-60 kDa Rb fusion protein (comprising amino acids 378 to 928 of retinoblastoma)
Residue:
928