Target
3-oxoacyl-[acyl-carrier-protein] synthase 3
Ligand
BDBM233084
Substrate
Meas. Tech.
3D-QSAR
IC50
135000±n/a nM
Citation
 Lu, XChen, YYou, Q 3D-QSAR, molecular docking studies, and binding mode prediction of thiolactomycin analogs as mtFabH inhibitors. J Enzyme Inhib Med Chem 25:240-9 (2010)  
Target
Name:
3-oxoacyl-[acyl-carrier-protein] synthase 3
Synonyms:
β-Ketoacyl-acyl carrier protein (ACP) synthase III (FabH) FABH_MYCTU | fabH
Type:
Enzyme
Mol. Mass.:
34865.07
Organism:
Mycobacterium tuberculosis
Description:
P9WNG3
Residue:
335
  
Inhibitor
Name:
BDBM233084
Synonyms:
mtFabH inhibitor, 31
Type:
Small organic molecule
Emp. Form.:
C19H16F2O2S
Mol. Mass.:
346.391
SMILES:
CC1=C(O)C(C)(Cc2ccc(cc2)-c2cc(F)cc(F)c2)SC1=O
: