Target
Acetylcholinesterase
Ligand
BDBM233116
Substrate
Meas. Tech.
Acetylcholinesterase Inhibition Assay
pH
8±0
Temperature
303.15±0 K
IC50
5.5e+3±n/a nM
Citation
 Zelík, PLukesová, ACejka, JBudesínský, MHavlícek, VCegan, AKopecký, J Nostotrebin 6, a bis(cyclopentenedione) with cholinesterase inhibitory activity isolated from Nostoc sp. str. Lukesová 27/97. J Enzyme Inhib Med Chem 25:414-20 (2010)  
Target
Name:
Acetylcholinesterase
Synonyms:
ACES_ELEEL Acetylcholinesterase (EeAChE) | ache
Type:
Enzyme
Mol. Mass.:
71812.79
Organism:
Electrophorus electricus (Electric eel)
Description:
Residue:
633
  
Inhibitor
Name:
BDBM233116
Synonyms:
Nostotrebin 6
Type:
Small organic molecule
Emp. Form.:
C50H38O10
Mol. Mass.:
798.8307
SMILES:
Oc1ccc(CC2=C(Cc3ccc(O)cc3)C(=O)C(C2=O)(c2ccc(O)cc2)C2(C(=O)C(Cc3ccc(O)cc3)=C(Cc3ccc(O)cc3)C2=O)c2ccc(O)cc2)cc1
: