Target
Carboxylic ester hydrolase
Ligand
BDBM8961
Substrate
Meas. Tech.
Acetylcholinesterase Inhibition Assay
pH
8±0
Temperature
303.15±0 K
IC50
9.1±n/a nM
Citation
 Zelík, PLukesová, ACejka, JBudesínský, MHavlícek, VCegan, AKopecký, J Nostotrebin 6, a bis(cyclopentenedione) with cholinesterase inhibitory activity isolated from Nostoc sp. str. Lukesová 27/97. J Enzyme Inhib Med Chem 25:414-20 (2010)  
Target
Name:
Carboxylic ester hydrolase
Synonyms:
BuChE Butyrylcholine esterase Butyrylcholinesterase (BChE) Butyrylcholinesterase (EqBuChE) butyrylcholinesterase precursor
Type:
Protein
Mol. Mass.:
68842.83
Organism:
Equus caballus (Horse)
Description:
Q9N1N9
Residue:
602
  
Inhibitor
Name:
BDBM8961
Synonyms:
1,2,3,4-tetrahydro-9-acridinamine 9-THA CHEMBL1337960 Cognex Tracine cid_1935 | tacrine.HCl
Type:
Small organic molecule
Emp. Form.:
C13H14N2
Mol. Mass.:
198.2637
SMILES:
Nc1c2CCCCc2nc2ccccc12
: