Target
Prolyl endopeptidase FAP
Ligand
BDBM50009341
Substrate
Meas. Tech.
Enzymatic Assay
pH
8.3±n/a
Temperature
310.15±n/a K
IC50
270±20 nM
Comments
extracted
Citation
 Jansen, KDe Meester, IHeirbaut, LCheng, JDJoossens, JAugustyns, KVan Der Veken, P FAP inhibitors US Patent  US9346814 Publication Date 5/24/2016 
Target
Name:
Prolyl endopeptidase FAP
Synonyms:
Fap SEPR_MOUSE | Seprase
Type:
Enzyme
Mol. Mass.:
87949.14
Organism:
Mus musculus (Mouse)
Description:
P97321
Residue:
761
  
Inhibitor
Name:
BDBM50009341
Synonyms:
CHEMBL3233560 | US9346814, Cmpd No 16 Example 20
Type:
Small organic molecule
Emp. Form.:
C20H17N5O2
Mol. Mass.:
359.3813
SMILES:
O=C(CNC(=O)c1ccnc(c1)-c1ccc(cc1)C#N)N1CCC[C@H]1C#N
: