Target
Dipeptidyl peptidase 9
Ligand
BDBM50009341
Substrate
Meas. Tech.
Enzymatic Assay
pH
8.3±n/a
Temperature
310.15±n/a K
IC50
>100000±n/a nM
Comments
extracted
Citation
 Jansen, KDe Meester, IHeirbaut, LCheng, JDJoossens, JAugustyns, KVan Der Veken, P FAP inhibitors US Patent  US9346814 Publication Date 5/24/2016 
Target
Name:
Dipeptidyl peptidase 9
Synonyms:
DPP9 DPRP-2 Dipeptidyl peptidase 9 (DDP9) Dipeptidyl peptidase 9 (DPP9) Dipeptidyl peptidase IX Dipeptidyl peptidase-like protein 9
Type:
Enzyme
Mol. Mass.:
98260.70
Organism:
Homo sapiens (Human)
Description:
Q86TI2
Residue:
863
  
Inhibitor
Name:
BDBM50009341
Synonyms:
CHEMBL3233560 | US9346814, Cmpd No 16 Example 20
Type:
Small organic molecule
Emp. Form.:
C20H17N5O2
Mol. Mass.:
359.3813
SMILES:
O=C(CNC(=O)c1ccnc(c1)-c1ccc(cc1)C#N)N1CCC[C@H]1C#N
: