Target
Dipeptidyl peptidase 2
Ligand
BDBM50009341
Substrate
Meas. Tech.
Enzymatic Assay
pH
8.3±n/a
Temperature
310.15±n/a K
IC50
>100000±n/a nM
Comments
extracted
Citation
 Jansen, KDe Meester, IHeirbaut, LCheng, JDJoossens, JAugustyns, KVan Der Veken, P FAP inhibitors US Patent  US9346814 Publication Date 5/24/2016 
Target
Name:
Dipeptidyl peptidase 2
Synonyms:
DAP II DPP2_HUMAN Dipeptidyl aminopeptidase II Dipeptidyl peptidase 2 (DPP2) Dipeptidyl peptidase II (DPP II) Dipeptidyl peptidase II and dipeptidyl peptidase IV (DPP2 and DPP4) carboxytripeptidase dipeptidyl(amino)peptidase II | dipeptidylarylamidase
Type:
Protein
Mol. Mass.:
54339.29
Organism:
Homo sapiens (Human)
Description:
Q9UHL4
Residue:
492
  
Inhibitor
Name:
BDBM50009341
Synonyms:
CHEMBL3233560 | US9346814, Cmpd No 16 Example 20
Type:
Small organic molecule
Emp. Form.:
C20H17N5O2
Mol. Mass.:
359.3813
SMILES:
O=C(CNC(=O)c1ccnc(c1)-c1ccc(cc1)C#N)N1CCC[C@H]1C#N
: