Target
Mitogen-activated protein kinase 1
Ligand
BDBM233413
Substrate
Meas. Tech.
Active ERK2 (aERK) Assay
IC50
33.9±n/a nM
Citation
 Shipps, Jr., GWHuang, XDeng, YZhu, LCooper, ABSun, BAchab, ALo, S Indazole derivatives useful as ERK inhibitors US Patent  US9351965 Publication Date 5/31/2016 
Target
Name:
Mitogen-activated protein kinase 1
Synonyms:
ERT1 Extracellular signal-regulated kinase 2 MAP kinase 1 MAP kinase ERK2 MAPK 2 Mapk Mitogen-activated protein kinase 2 p42 | p42-MAPK
Type:
Protein
Mol. Mass.:
41278.65
Organism:
Mus musculus (Mouse)
Description:
P63085
Residue:
358
  
Inhibitor
Name:
BDBM233413
Synonyms:
US9351965, 20
Type:
Small organic molecule
Emp. Form.:
C28H24F2N4O2S
Mol. Mass.:
518.578
SMILES:
O[C@]1(Cc2c(F)cccc2F)CCC[C@H](C1)NC(=O)c1ccc2[nH]nc(-c3ccc4ncsc4c3)c2c1
: