Target
Mitogen-activated protein kinase 1
Ligand
BDBM233420
Substrate
Meas. Tech.
Active ERK2 (aERK) Assay
IC50
61.0±n/a nM
Citation
 Shipps, Jr., GWHuang, XDeng, YZhu, LCooper, ABSun, BAchab, ALo, S Indazole derivatives useful as ERK inhibitors US Patent  US9351965 Publication Date 5/31/2016 
Target
Name:
Mitogen-activated protein kinase 1
Synonyms:
ERT1 Extracellular signal-regulated kinase 2 MAP kinase 1 MAP kinase ERK2 MAPK 2 Mapk Mitogen-activated protein kinase 2 p42 | p42-MAPK
Type:
Protein
Mol. Mass.:
41278.65
Organism:
Mus musculus (Mouse)
Description:
P63085
Residue:
358
  
Inhibitor
Name:
BDBM233420
Synonyms:
US9351965, 27 US9351965, 33
Type:
Small organic molecule
Emp. Form.:
C26H25FN4O2
Mol. Mass.:
444.5007
SMILES:
Cc1cc(ccn1)-c1n[nH]c2ccc(cc12)C(=O)NC1CCCC(C1)Oc1ccccc1F
: