Target
Mitogen-activated protein kinase 1
Ligand
BDBM233514
Substrate
Meas. Tech.
Active ERK2 (aERK) Assay
IC50
37.2±n/a nM
Citation
 Shipps, Jr., GWHuang, XDeng, YZhu, LCooper, ABSun, BAchab, ALo, S Indazole derivatives useful as ERK inhibitors US Patent  US9351965 Publication Date 5/31/2016 
Target
Name:
Mitogen-activated protein kinase 1
Synonyms:
ERT1 Extracellular signal-regulated kinase 2 MAP kinase 1 MAP kinase ERK2 MAPK 2 Mapk Mitogen-activated protein kinase 2 p42 | p42-MAPK
Type:
Protein
Mol. Mass.:
41278.65
Organism:
Mus musculus (Mouse)
Description:
P63085
Residue:
358
  
Inhibitor
Name:
BDBM233514
Synonyms:
US9351965, 121
Type:
Small organic molecule
Emp. Form.:
C30H29N5O2
Mol. Mass.:
491.5836
SMILES:
Cc1cc(ccn1)-c1n[nH]c2ccc(cc12)C(=O)NC1CCCC(Cn2c3ccccc3ccc2=O)C1
: