Target
Histone deacetylase 6
Ligand
BDBM22164
Substrate
Meas. Tech.
Fluorescent Activity Assay
Temperature
298.15±n/a K
IC50
14151±n/a nM
Comments
extracted
Citation
 Lin, JFang, JChern, TChen, JChen, CWei, T 3,5,N-trihydroxy-alkanamide and derivatives: method for making same and use thereof US Patent  US9353061 Publication Date 5/31/2016 
Target
Name:
Histone deacetylase 6
Synonyms:
Cereblon/Histone deacetylase 6 HDAC6 Histone deacetylase 6 (HDAC6) KIAA0901 | ORF Names:JM21
Type:
Chromatin regulator; hydrolase; repressor
Mol. Mass.:
131381.51
Organism:
Homo sapiens (Human)
Description:
Q9UBN7
Residue:
1215
  
Inhibitor
Name:
BDBM22164
Synonyms:
(3R,5R)-7-[2-(4-fluorophenyl)-3-phenyl-4-(phenylcarbamoyl)-5-(propan-2-yl)-1H-pyrrol-1-yl]-3,5-dihydroxyheptanoic acid Atorvastatin CI 981 US9353061, Atorvastatina
Type:
Small organic molecule
Emp. Form.:
C33H35FN2O5
Mol. Mass.:
558.6398
SMILES:
CC(C)c1c(C(=O)Nc2ccccc2)c(c(-c2ccc(F)cc2)n1CC[C@@H](O)C[C@@H](O)CC(O)=O)-c1ccccc1
: