Target
Tyrosine-protein kinase SYK
Ligand
BDBM233626
Substrate
Meas. Tech.
Homogeneous Time-Resolved Fluorescence (HTRF) Assay
pH
7.5±n/a
Temperature
298.15±n/a K
IC50
4.6±n/a nM
Comments
extracted
Citation
 Haidle, AMBurch, JGuay, DGauthier, JYRobichaud, JFournier, JFEllis, JMChristopher, MKattar, SDSmith, GFNorthrup, AB Substituted phenyl-Spleen Tyrosine Kinase (Syk) inhibitors US Patent  US9353066 Publication Date 5/31/2016 
Target
Name:
Tyrosine-protein kinase SYK
Synonyms:
KSYK_HUMAN Spleen Tyrosine Kinase Tyrosine-protein kinase SYK (Syk)
Type:
Enzyme
Mol. Mass.:
72079.99
Organism:
Homo sapiens (Human)
Description:
P43405
Residue:
635
  
Inhibitor
Name:
BDBM233626
Synonyms:
US9353066, 1.79
Type:
Small Organic Molecule
Emp. Form.:
C21H17F3N4O3
Mol. Mass.:
430.3799
SMILES:
Cc1cc(Nc2nccc(n2)C(F)(F)F)cc(c1)-c1cccc(c1)C(=O)NCC(O)=O
: