Target
Tyrosine-protein kinase SYK
Ligand
BDBM233627
Substrate
Meas. Tech.
Homogeneous Time-Resolved Fluorescence (HTRF) Assay
pH
7.5±n/a
Temperature
298.15±n/a K
IC50
1.3±n/a nM
Comments
extracted
Citation
 Haidle, AMBurch, JGuay, DGauthier, JYRobichaud, JFournier, JFEllis, JMChristopher, MKattar, SDSmith, GFNorthrup, AB Substituted phenyl-Spleen Tyrosine Kinase (Syk) inhibitors US Patent  US9353066 Publication Date 5/31/2016 
Target
Name:
Tyrosine-protein kinase SYK
Synonyms:
KSYK_HUMAN Spleen Tyrosine Kinase Tyrosine-protein kinase SYK (Syk)
Type:
Enzyme
Mol. Mass.:
72079.99
Organism:
Homo sapiens (Human)
Description:
P43405
Residue:
635
  
Inhibitor
Name:
BDBM233627
Synonyms:
US9353066, 1.80
Type:
Small Organic Molecule
Emp. Form.:
C27H28F3N3O3
Mol. Mass.:
499.5247
SMILES:
Cc1cc(Nc2nccc(n2)C(F)(F)F)cc(c1)-c1ccc(cc1)C(C)(O)[C@H]1CC[C@@H](CC1)C(O)=O
: