Target
Tyrosine-protein kinase SYK
Ligand
BDBM233687
Substrate
Meas. Tech.
Homogeneous Time-Resolved Fluorescence (HTRF) Assay
pH
7.5±n/a
Temperature
298.15±n/a K
IC50
6.2±n/a nM
Comments
extracted
Citation
 Haidle, AMBurch, JGuay, DGauthier, JYRobichaud, JFournier, JFEllis, JMChristopher, MKattar, SDSmith, GFNorthrup, AB Substituted phenyl-Spleen Tyrosine Kinase (Syk) inhibitors US Patent  US9353066 Publication Date 5/31/2016 
Target
Name:
Tyrosine-protein kinase SYK
Synonyms:
KSYK_HUMAN Spleen Tyrosine Kinase Tyrosine-protein kinase SYK (Syk)
Type:
Enzyme
Mol. Mass.:
72079.99
Organism:
Homo sapiens (Human)
Description:
P43405
Residue:
635
  
Inhibitor
Name:
BDBM233687
Synonyms:
US9353066, 1.141
Type:
Small Organic Molecule
Emp. Form.:
C19H17N3O3
Mol. Mass.:
335.3566
SMILES:
COc1ccnc(Nc2cc(C)cc(c2)-c2cccc(c2)C(O)=O)n1
: