Target
Tyrosine-protein kinase SYK
Ligand
BDBM233689
Substrate
Meas. Tech.
Homogeneous Time-Resolved Fluorescence (HTRF) Assay
pH
7.5±n/a
Temperature
298.15±n/a K
IC50
15.8±n/a nM
Comments
extracted
Citation
 Haidle, AMBurch, JGuay, DGauthier, JYRobichaud, JFournier, JFEllis, JMChristopher, MKattar, SDSmith, GFNorthrup, AB Substituted phenyl-Spleen Tyrosine Kinase (Syk) inhibitors US Patent  US9353066 Publication Date 5/31/2016 
Target
Name:
Tyrosine-protein kinase SYK
Synonyms:
KSYK_HUMAN Spleen Tyrosine Kinase Tyrosine-protein kinase SYK (Syk)
Type:
Enzyme
Mol. Mass.:
72079.99
Organism:
Homo sapiens (Human)
Description:
P43405
Residue:
635
  
Inhibitor
Name:
BDBM233689
Synonyms:
US9353066, 1.143
Type:
Small Organic Molecule
Emp. Form.:
C25H26N6
Mol. Mass.:
410.5141
SMILES:
N#Cc1cnc(Nc2cccc(c2)-c2ccccc2)nc1N1CCC2(CCNC2)CC1
: