Target
Tyrosine-protein kinase SYK
Ligand
BDBM233723
Substrate
Meas. Tech.
Homogeneous Time-Resolved Fluorescence (HTRF) Assay
pH
7.5±n/a
Temperature
298.15±n/a K
IC50
14.3±n/a nM
Comments
extracted
Citation
 Haidle, AMBurch, JGuay, DGauthier, JYRobichaud, JFournier, JFEllis, JMChristopher, MKattar, SDSmith, GFNorthrup, AB Substituted phenyl-Spleen Tyrosine Kinase (Syk) inhibitors US Patent  US9353066 Publication Date 5/31/2016 
Target
Name:
Tyrosine-protein kinase SYK
Synonyms:
KSYK_HUMAN Spleen Tyrosine Kinase Tyrosine-protein kinase SYK (Syk)
Type:
Enzyme
Mol. Mass.:
72079.99
Organism:
Homo sapiens (Human)
Description:
P43405
Residue:
635
  
Inhibitor
Name:
BDBM233723
Synonyms:
US9353066, 3.21
Type:
Small Organic Molecule
Emp. Form.:
C25H19F3N4O3
Mol. Mass.:
480.4386
SMILES:
Cc1cc(Nc2nccc(n2)C(F)(F)F)cc(c1)-c1ccc(OCc2ccccn2)c(c1)C(O)=O
: