Target
Tyrosine-protein kinase SYK
Ligand
BDBM233742
Substrate
Meas. Tech.
Homogeneous Time-Resolved Fluorescence (HTRF) Assay
pH
7.5±n/a
Temperature
298.15±n/a K
IC50
17.4±n/a nM
Comments
extracted
Citation
 Haidle, AMBurch, JGuay, DGauthier, JYRobichaud, JFournier, JFEllis, JMChristopher, MKattar, SDSmith, GFNorthrup, AB Substituted phenyl-Spleen Tyrosine Kinase (Syk) inhibitors US Patent  US9353066 Publication Date 5/31/2016 
Target
Name:
Tyrosine-protein kinase SYK
Synonyms:
KSYK_HUMAN Spleen Tyrosine Kinase Tyrosine-protein kinase SYK (Syk)
Type:
Enzyme
Mol. Mass.:
72079.99
Organism:
Homo sapiens (Human)
Description:
P43405
Residue:
635
  
Inhibitor
Name:
BDBM233742
Synonyms:
US9353066, 3.40
Type:
Small Organic Molecule
Emp. Form.:
C24H23F3N4O4
Mol. Mass.:
488.459
SMILES:
CC(=O)NCCCOc1ccc(cc1C(O)=O)-c1cc(C)cc(Nc2nccc(n2)C(F)(F)F)c1
: