Target
Sodium channel protein type 9 subunit alpha
Ligand
BDBM234218
Substrate
Meas. Tech.
FLIPR Assay
pH
7.3±n/a
IC50
954±153 nM
Comments
extracted
Citation
 Tafesse, LPark, JH Substituted piperidines as sodium channel blockers US Patent  US9359330 Publication Date 6/7/2016 
Target
Name:
Sodium channel protein type 9 subunit alpha
Synonyms:
NENA Peripheral sodium channel 1 SCN9A_HUMAN Voltage-gated sodium channel subunit Nav1.7 hNE-Na
Type:
Protein
Mol. Mass.:
226375.97
Organism:
Homo sapiens (Human)
Description:
Q15858
Residue:
1988
  
Inhibitor
Name:
BDBM234218
Synonyms:
US9359330, 15
Type:
Small organic molecule
Emp. Form.:
C24H21F4N3O2
Mol. Mass.:
459.4361
SMILES:
Fc1ccc(cn1)-c1ccccc1C1CCCN(C1)C(=O)c1ccc(OCC(F)(F)F)nc1
: