Target
Alpha-1,6-mannosyl-glycoprotein 2-beta-N-acetylglucosaminyltransferase
Ligand
BDBM235196
Substrate
Meas. Tech.
LCMS Assay
pH
7.4±n/a
Temperature
338.15±n/a K
IC50
17±n/a nM
Comments
extracted
Citation
 Ahmad, SNegash, LA Dihydropyridinone MGAT2 inhibitors US Patent  US9365558 Publication Date 6/14/2016 
Target
Name:
Alpha-1,6-mannosyl-glycoprotein 2-beta-N-acetylglucosaminyltransferase
Synonyms:
2.4.1.143 GNT-II MGAT2 Mannoside acetylglucosaminyltransferase 2 Monoacylglycerol acyltransferase type 2 (h-MGAT2) h-MGAT2 (human monoacylglycerol acyltransferase type 2)
Type:
Mol. Mass.:
51567.80
Organism:
Homo sapiens (Human)
Description:
Q10469
Residue:
447
  
Inhibitor
Name:
BDBM235196
Synonyms:
US9365558, 19 | US9822074, 19
Type:
Small organic molecule
Emp. Form.:
C26H26F6N2O5S
Mol. Mass.:
592.55
SMILES:
CCS(=O)(=O)NC(=O)C1=C(C[C@](NC1=O)(c1ccc(OCCCC(F)(F)F)cc1)C(F)(F)F)c1ccc(C)cc1
: