Target
Epidermal growth factor receptor [T790M,L858R]
Ligand
BDBM235633
Substrate
Meas. Tech.
Enzyme Assay
IC50
6.8±n/a nM
Citation
 Xia, XZhang, D Substituted aminoquinazolines useful as kinases inhibitors US Patent  US9388170 Publication Date 7/12/2016 
Target
Name:
Epidermal growth factor receptor [T790M,L858R]
Synonyms:
EGFR EGFR_HUMAN ERBB1 Epidermal growth factor receptor (EGFR)(T790M/L858R) Epidermal growth factor receptor (T790M, L858R) Epidermal growth factor receptor(L858R, T790M) | HER1
Type:
Mol. Mass.:
134353.72
Organism:
Homo sapiens (Human)
Description:
P00533[T790M,L858R]
Residue:
1210
  
Inhibitor
Name:
BDBM235633
Synonyms:
US9388170, 20
Type:
Small organic molecule
Emp. Form.:
C28H31N5O3
Mol. Mass.:
485.5774
SMILES:
CCN(CC)C\C=C\C(=O)Nc1cc2c(Nc3cccc(c3)C#C)ncnc2cc1O[C@H]1CCOC1
: