Target
Tumor necrosis factor
Ligand
BDBM235306
Substrate
Meas. Tech.
ELISA Assay
Temperature
298.15±n/a K
IC50
920±n/a nM
Comments
extracted
Citation
 Mjalli, AMGaddam, BPolisetti, DRKostura, MJGuzel, M Tricyclic compounds as modulators of TNF-alpha synthesis and as PDE4 inhibitors US Patent  US9393245 Publication Date 7/19/2016 
Target
Name:
Tumor necrosis factor
Synonyms:
Cachectin TNF-a TNFA TNFSF2 Tumor necrosis factor (TNFa) Tumor necrosis factor ligand superfamily member 2 Tumor necrosis factor, soluble form | tumor necrosis factor alpha
Type:
Enzyme
Mol. Mass.:
25645.11
Organism:
Homo sapiens (Human)
Description:
P01375
Residue:
233
  
Inhibitor
Name:
BDBM235306
Synonyms:
US10085990, Example 29 | US9393245, 29
Type:
Small organic molecule
Emp. Form.:
C19H20FN3O3
Mol. Mass.:
357.3788
SMILES:
CCn1c(=O)n(C2CCCC2)c2c3cc(F)cc(OC)c3ncc2c1=O
: