Target
Aminopeptidase N
Ligand
BDBM235702
Substrate
Meas. Tech.
In Vitro APN Inhibition Assay
IC50
69100±1400 nM
Citation
 Yang, KFen, JFang, HZhang, LGong, JXu, W Synthesis of a novel series of L-isoserine derivatives as aminopeptidase N inhibitors. J Enzyme Inhib Med Chem 27:302-10 (2012)  
Target
Name:
Aminopeptidase N
Synonyms:
AMPN_PIG AP-M Alanyl aminopeptidase Aminopeptidase N (APN) Microsomal aminopeptidase pAPN
Type:
Protein
Mol. Mass.:
108810.25
Organism:
Sus scrofa (Pig)
Description:
P15145
Residue:
963
  
Inhibitor
Name:
BDBM235702
Synonyms:
L-Isoseryl-L-leucyl-L-phenylalanine benzyl ester hydrochloride (13c)
Type:
Small organic molecule
Emp. Form.:
C19H29N3O5
Mol. Mass.:
379.4507
SMILES:
COC(=O)[C@H](CC(C)C)NC(=O)[C@H](Cc1ccccc1)NC(=O)[C@@H](O)CN
: