Target
Kappa-type opioid receptor
Ligand
BDBM235793
Substrate
Meas. Tech.
Time Resolved Fluorescence Resonance Energy Transfer (TR-FRET)-Based cAMP Immunoassay
Temperature
298.15±n/a K
EC50
0.052±n/a nM
Comments
extracted
Citation
 Schteingart, CDMenzaghi, FJiang, GAlexander, RVSueiras-Diaz, JSpencer, RHChalmers, DTLuo, RZ Synthetic peptide amides US Patent  US9359399 Publication Date 6/7/2016 
Target
Name:
Kappa-type opioid receptor
Synonyms:
KOR-1 OPIATE Kappa Oprk1
Type:
Enzyme
Mol. Mass.:
42656.78
Organism:
Mus musculus (Mouse)
Description:
P33534
Residue:
380
  
Inhibitor
Name:
BDBM235793
Synonyms:
US9359399, 3
Type:
Small organic molecule
Emp. Form.:
C37H55N7O6
Mol. Mass.:
693.8759
SMILES:
CNCCCC[C@@H](NC(=O)[C@@H](CC(C)C)NC(=O)[C@@H](Cc1ccccc1)NC(=O)[C@H](N)Cc1ccccc1)C(=O)N1CCC(N)(CC1)C(O)=O
: