Target
NAD-dependent protein deacetylase sirtuin-1
Ligand
BDBM235912
Substrate
Meas. Tech.
Inhibition Assay
IC50
43900±7300 nM
Citation
 Lain, SWestwood, NJLane, DP Aroyl thiourea derivatives US Patent  US9365508 Publication Date 6/14/2016 
Target
Name:
NAD-dependent protein deacetylase sirtuin-1
Synonyms:
NAD-Dependent Deacetylase Sirtuin-1 NAD-dependent protein deacetylase sirtuin-1 (SIRT1) SIR2-like protein 1 SIRT1 Sirtuin-1 (SIRT1) | hSIR2
Type:
Developmental protein; hydrolase
Mol. Mass.:
81626.66
Organism:
Homo sapiens (Human)
Description:
Residue:
747
  
Inhibitor
Name:
BDBM235912
Synonyms:
US9365508, 330a (3-Br, 4-Me)
Type:
Small organic molecule
Emp. Form.:
C22H27BrN4O2S
Mol. Mass.:
491.444
SMILES:
CN(C)CCCCC(=O)Nc1ccc(NC(=S)NC(=O)c2ccc(C)c(Br)c2)cc1
: