Target
NAD-dependent protein deacetylase sirtuin-1
Ligand
BDBM235917
Substrate
Meas. Tech.
Inhibition Assay
IC50
22500±1300 nM
Citation
 Lain, SWestwood, NJLane, DP Aroyl thiourea derivatives US Patent  US9365508 Publication Date 6/14/2016 
Target
Name:
NAD-dependent protein deacetylase sirtuin-1
Synonyms:
NAD-Dependent Deacetylase Sirtuin-1 NAD-dependent protein deacetylase sirtuin-1 (SIRT1) SIR2-like protein 1 SIRT1 Sirtuin-1 (SIRT1) | hSIR2
Type:
Developmental protein; hydrolase
Mol. Mass.:
81626.66
Organism:
Homo sapiens (Human)
Description:
Residue:
747
  
Inhibitor
Name:
BDBM235917
Synonyms:
US9365508, 392a (3,5-Cl2, 4-OBu)
Type:
Small organic molecule
Emp. Form.:
C25H32Cl2N4O3S
Mol. Mass.:
539.518
SMILES:
CCCCOc1c(Cl)cc(cc1Cl)C(=O)NC(=S)Nc1ccc(NC(=O)CCCCN(C)C)cc1
: