Target
NAD-dependent protein deacetylase sirtuin-2
Ligand
BDBM50363782
Substrate
Meas. Tech.
Inhibition Assay
IC50
21200±7200 nM
Citation
 Lain, SWestwood, NJLane, DP Aroyl thiourea derivatives US Patent  US9365508 Publication Date 6/14/2016 
Target
Name:
NAD-dependent protein deacetylase sirtuin-2
Synonyms:
NAD-Dependent Deacetylase Sirtuin-2 NAD-dependent deacetylase sirtuin 3 SIR2-like SIR2L SIR2_HUMAN Sirtuin 2 (SIRT2)
Type:
Hydrolase
Mol. Mass.:
43172.62
Organism:
Homo sapiens (Human)
Description:
Residue:
389
  
Inhibitor
Name:
BDBM50363782
Synonyms:
CHEMBL1945264 | US9365508, A6 (3-Br)
Type:
Small organic molecule
Emp. Form.:
C21H25BrN4O2S
Mol. Mass.:
477.418
SMILES:
CN(C)CCCCC(=O)Nc1ccc(NC(=S)NC(=O)c2cccc(Br)c2)cc1
: