Target
NAD-dependent protein deacetylase sirtuin-2
Ligand
BDBM235913
Substrate
Meas. Tech.
Inhibition Assay
IC50
>90000±n/a nM
Citation
 Lain, SWestwood, NJLane, DP Aroyl thiourea derivatives US Patent  US9365508 Publication Date 6/14/2016 
Target
Name:
NAD-dependent protein deacetylase sirtuin-2
Synonyms:
NAD-Dependent Deacetylase Sirtuin-2 NAD-dependent deacetylase sirtuin 3 SIR2-like SIR2L SIR2_HUMAN Sirtuin 2 (SIRT2)
Type:
Hydrolase
Mol. Mass.:
43172.62
Organism:
Homo sapiens (Human)
Description:
Residue:
389
  
Inhibitor
Name:
BDBM235913
Synonyms:
US9365508, C6 (3-CF3,
Type:
Small organic molecule
Emp. Form.:
C23H27F3N4O3S
Mol. Mass.:
496.546
SMILES:
COc1ccc(cc1C(F)(F)F)C(=O)NC(=S)Nc1ccc(NC(=O)CCCCN(C)C)cc1
: