Target
Histamine H3 receptor
Ligand
BDBM50088162
Substrate
Meas. Tech.
HTRF cAMP Assay
IC50
0.67±n/a nM
Citation
 Covel, JARen, ASSemple, GTran, TWei, ZXiong, Y Biphenyl-ethyl-pyrrolidine derivatives as histamine H3 receptor modulators for the treatment of cognitive disorders US Patent  US9365511 Publication Date 6/14/2016 
Target
Name:
Histamine H3 receptor
Synonyms:
G-protein coupled receptor 97 HH3R HRH3 Histamine H3 receptor (H3) Histamine receptor (H3 and H4)
Type:
G Protein-Coupled Receptor (GPCR)
Mol. Mass.:
48691.47
Organism:
Homo sapiens (Human)
Description:
Binding assays were using CHO cells stably expressing hH3R receptors.
Residue:
445
  
Inhibitor
Name:
BDBM50088162
Synonyms:
CHEMBL3427228 | US9365511, 4
Type:
Small organic molecule
Emp. Form.:
C24H31NO3
Mol. Mass.:
381.5078
SMILES:
CCOC(=O)COCc1ccc(cc1)-c1ccc(CCN2CCC[C@H]2C)cc1
: