Target
Disintegrin and metalloproteinase domain-containing protein 17
Ligand
BDBM113590
Substrate
Meas. Tech.
Inhibition Assay
pH
7.4±n/a
Temperature
310.15±n/a K
IC50
63±n/a nM
Comments
extracted
Citation
 Clary, LChambon, SChantalat, LRosignoli, CRoye, OPascal, JSchuppli-Nollet, M Benzenesulfonamide compounds, method for synthesizing same, and use thereof in medicine as well as in cosmetics US Patent  US9365529 Publication Date 6/14/2016 
Target
Name:
Disintegrin and metalloproteinase domain-containing protein 17
Synonyms:
ADA17_HUMAN CSVP Disintegrin and metalloproteinase domain-containing protein 17 (ADAM17) TNF-alpha convertase TNF-alpha-converting enzyme (TACE) Tumor necrosis factor-α converting enzyme (TACE)
Type:
Enzyme
Mol. Mass.:
93007.89
Organism:
Homo sapiens (Human)
Description:
Residue:
824
  
Inhibitor
Name:
BDBM113590
Synonyms:
US8633196, 21 | US9365529, 21
Type:
Small organic molecule
Emp. Form.:
C32H37N5O5S
Mol. Mass.:
603.732
SMILES:
Cc1ccc(CN2CCN(CC2)[C@@H](CNS(=O)(=O)c2ccc(OCc3cc(C)nc4ccccc34)cc2)C(=O)NO)cc1
: