Target
Disintegrin and metalloproteinase domain-containing protein 10
Ligand
BDBM113590
Substrate
Meas. Tech.
Inhibition Assay
IC50
>10000±n/a nM
Citation
 Clary, LChambon, SChantalat, LRosignoli, CRoye, OPascal, JSchuppli-Nollet, M Benzenesulfonamide compounds, method for synthesizing same, and use thereof in medicine as well as in cosmetics US Patent  US9365529 Publication Date 6/14/2016 
Target
Name:
Disintegrin and metalloproteinase domain-containing protein 10
Synonyms:
ADA10_HUMAN Disintegrin and metalloproteinase domain-containing protein 10 (ADAM10) MADM
Type:
Enzyme
Mol. Mass.:
84160.93
Organism:
Homo sapiens (Human)
Description:
O14672
Residue:
748
  
Inhibitor
Name:
BDBM113590
Synonyms:
US8633196, 21 | US9365529, 21
Type:
Small organic molecule
Emp. Form.:
C32H37N5O5S
Mol. Mass.:
603.732
SMILES:
Cc1ccc(CN2CCN(CC2)[C@@H](CNS(=O)(=O)c2ccc(OCc3cc(C)nc4ccccc34)cc2)C(=O)NO)cc1
: