Target
Disintegrin and metalloproteinase domain-containing protein 10
Ligand
BDBM50181008
Substrate
Meas. Tech.
Inhibition Assay
IC50
71±n/a nM
Citation
 Clary, LChambon, SChantalat, LRosignoli, CRoye, OPascal, JSchuppli-Nollet, M Benzenesulfonamide compounds, method for synthesizing same, and use thereof in medicine as well as in cosmetics US Patent  US9365529 Publication Date 6/14/2016 
Target
Name:
Disintegrin and metalloproteinase domain-containing protein 10
Synonyms:
ADA10_HUMAN Disintegrin and metalloproteinase domain-containing protein 10 (ADAM10) MADM
Type:
Enzyme
Mol. Mass.:
84160.93
Organism:
Homo sapiens (Human)
Description:
O14672
Residue:
748
  
Inhibitor
Name:
BDBM50181008
Synonyms:
(S)-N-hydroxy-4-(4-(4-hydroxybut-2-ynyloxy)phenylsulfonyl)-2,2-dimethylthiomorpholine-3-carboxamide TMI-05 US9365529, Apratastat
Type:
Small organic molecule
Emp. Form.:
C17H22N2O6S2
Mol. Mass.:
414.496
SMILES:
CC1(C)SCCN([C@H]1C(=O)NO)S(=O)(=O)c1ccc(OCC#CCO)cc1
: