Target
Lysosomal Pro-X carboxypeptidase
Ligand
BDBM235954
Substrate
Meas. Tech.
Enzyme Activity Assay
pH
5.5±n/a
IC50
0.51±n/a nM
Comments
extracted
Citation
 Hale, JJJiang, JShen, DShi, ZShu, MWu, ZYang, C Prolylcarboxypeptidase inhibitors US Patent  US9365539 Publication Date 6/14/2016 
Target
Name:
Lysosomal Pro-X carboxypeptidase
Synonyms:
Angiotensinase C PCP PRCP Prolylcarboxypeptidase | Prolylcarboxypeptidase (PRCP)
Type:
Enzyme
Mol. Mass.:
55805.19
Organism:
Homo sapiens (Human)
Description:
P42785
Residue:
496
  
Inhibitor
Name:
BDBM235954
Synonyms:
US9365539, 34
Type:
Small organic molecule
Emp. Form.:
C27H26FN5O2
Mol. Mass.:
471.526
SMILES:
OC(=O)C(CN1CCC(CC1)c1cc(nn1-c1ncccn1)-c1ccc(F)cc1)c1ccccc1
: