Target
Lysosomal Pro-X carboxypeptidase
Ligand
BDBM235957
Substrate
Meas. Tech.
Enzyme Activity Assay
pH
5.5±n/a
IC50
21.06±n/a nM
Comments
extracted
Citation
 Hale, JJJiang, JShen, DShi, ZShu, MWu, ZYang, C Prolylcarboxypeptidase inhibitors US Patent  US9365539 Publication Date 6/14/2016 
Target
Name:
Lysosomal Pro-X carboxypeptidase
Synonyms:
Angiotensinase C PCP PRCP Prolylcarboxypeptidase | Prolylcarboxypeptidase (PRCP)
Type:
Enzyme
Mol. Mass.:
55805.19
Organism:
Homo sapiens (Human)
Description:
P42785
Residue:
496
  
Inhibitor
Name:
BDBM235957
Synonyms:
US9365539, 60
Type:
Small organic molecule
Emp. Form.:
C25H29ClN4O2S
Mol. Mass.:
485.041
SMILES:
CS(=O)(=O)N1CCC(C1)N1CCC(CC1)c1cc(nn1-c1ccccc1)-c1ccc(Cl)cc1
: