Target
Gag-Pol polyprotein [489-587,Q496K]
Ligand
BDBM293284
Substrate
Meas. Tech.
Inhibition of HIV Replication
pH
7.55±n/a
EC50
7766±n/a nM
Comments
extracted
Citation
 Kadow, JFNaidu, BNTu, Y Pyridin-3-yl acetic acid derivatives as inhibitors of human immunodeficiency virus replication US Patent  US10106504 Publication Date 10/23/2018 
Target
Name:
Gag-Pol polyprotein [489-587,Q496K]
Synonyms:
HIV-1 Protease Chain A POL_HV1N5 | gag-pol
Type:
Enzyme Subunit
Mol. Mass.:
10823.26
Organism:
Human immunodeficiency virus type 1
Description:
P12497[489-587,Q496K]
Residue:
99
  
Inhibitor
Name:
BDBM293284
Synonyms:
US10106504, Example 21
Type:
Small organic molecule
Emp. Form.:
C31H36N2O4
Mol. Mass.:
500.6285
SMILES:
Cc1nc(C)c(-c2ccc3CNCCc3c2)c(-c2ccc3OCCCc3c2)c1[C@H](OC(C)(C)C)C(O)=O
: