Target
Gag-Pol polyprotein [489-587,Q496K]
Ligand
BDBM293285
Substrate
Meas. Tech.
Inhibition of HIV Replication
pH
7.55±n/a
EC50
628±n/a nM
Comments
extracted
Citation
 Kadow, JFNaidu, BNTu, Y Pyridin-3-yl acetic acid derivatives as inhibitors of human immunodeficiency virus replication US Patent  US10106504 Publication Date 10/23/2018 
Target
Name:
Gag-Pol polyprotein [489-587,Q496K]
Synonyms:
HIV-1 Protease Chain A POL_HV1N5 | gag-pol
Type:
Enzyme Subunit
Mol. Mass.:
10823.26
Organism:
Human immunodeficiency virus type 1
Description:
P12497[489-587,Q496K]
Residue:
99
  
Inhibitor
Name:
BDBM293285
Synonyms:
US10106504, Example 22
Type:
Small organic molecule
Emp. Form.:
C32H38N2O4
Mol. Mass.:
514.6551
SMILES:
CN1CCc2cc(ccc2C1)-c1c(C)nc(C)c([C@H](OC(C)(C)C)C(O)=O)c1-c1ccc2OCCCc2c1
: