Target
Mu-type opioid receptor
Ligand
BDBM236847
Substrate
Meas. Tech.
[35S]GTPγS Functional Assay
pH
7.4±n/a
Temperature
298.15±n/a K
EC50
18.6±8.05 nM
Comments
extracted
Citation
 Kassick, ALockman, JTafesse, L Substituted morphinans and the use thereof US Patent  US9388162 Publication Date 7/12/2016 
Target
Name:
Mu-type opioid receptor
Synonyms:
M-OR-1 MOR-1 MUOR1 Mu opiate receptor OPRM1 hMOP | mu-type opioid receptor isoform MOR-1
Type:
G Protein-Coupled Receptor (GPCR)
Mol. Mass.:
44789.51
Organism:
Homo sapiens (Human)
Description:
P35372
Residue:
400
  
Inhibitor
Name:
BDBM236847
Synonyms:
US9388162, 32
Type:
Small organic molecule
Emp. Form.:
C25H34N2O4
Mol. Mass.:
426.5485
SMILES:
CC(C)(C)C(=O)N[C@H]1C[C@@]2(O)[C@H]3Cc4ccc(O)cc4[C@@]2(CCN3CC2CC2)CC1=O
: