Target
Fructose-bisphosphate aldolase
Ligand
BDBM32203
Substrate
Meas. Tech.
Enzymatic Assay
IC50
300000±67000 nM
Citation
 Pegan, SDAhrendt, KCapodagli, GCCowen, B Antibiotic and anti-parasitic agents that modulate class II fructose 1,6-bisphosphate aldolase US Patent  US9394254 Publication Date 7/19/2016 
Target
Name:
Fructose-bisphosphate aldolase
Synonyms:
ALF_MYCTU FBPA Fructose-1,6-bisphosphate aldolase (FBA) Probable fructose-bisphosphate aldolase Fba | fba
Type:
Protein
Mol. Mass.:
36539.01
Organism:
Mycobacterium tuberculosis (strain H37Rv)
Description:
P9WQA3
Residue:
344
  
Inhibitor
Name:
BDBM32203
Synonyms:
8-quinolinol US10005735, Table 1.7 cid_1923 quinolin-8-ol
Type:
Small organic molecule
Emp. Form.:
C9H7NO
Mol. Mass.:
145.158
SMILES:
Oc1cccc2cccnc12
: