Target
Fructose-bisphosphate aldolase
Ligand
BDBM237137
Substrate
Meas. Tech.
Enzymatic Assay
IC50
570000±87000 nM
Citation
 Pegan, SDAhrendt, KCapodagli, GCCowen, B Antibiotic and anti-parasitic agents that modulate class II fructose 1,6-bisphosphate aldolase US Patent  US9394254 Publication Date 7/19/2016 
Target
Name:
Fructose-bisphosphate aldolase
Synonyms:
ALF_MYCTU FBPA Fructose-1,6-bisphosphate aldolase (FBA) Probable fructose-bisphosphate aldolase Fba | fba
Type:
Protein
Mol. Mass.:
36539.01
Organism:
Mycobacterium tuberculosis (strain H37Rv)
Description:
P9WQA3
Residue:
344
  
Inhibitor
Name:
BDBM237137
Synonyms:
US9394254, 34
Type:
Small organic molecule
Emp. Form.:
C10H10N2O3S
Mol. Mass.:
238.263
SMILES:
CS(=O)(=O)Nc1ccc2cccc(O)c2n1
: