Target
Histone-lysine N-methyltransferase SMYD3
Ligand
BDBM293351
Substrate
Meas. Tech.
SMYD3 Biochemical Assay
IC50
671±n/a nM
Citation
 Foley, MAKuntz, KWMitchell, LHMunchhof, MJ Substituted isoxazoles for treating cancer US Patent  US10106510 Publication Date 10/23/2018 
Target
Name:
Histone-lysine N-methyltransferase SMYD3
Synonyms:
SET and MYND domain-containing protein 3 SMYD3_HUMAN ZNFN3A1 | Zinc finger MYND domain-containing protein 1
Type:
Enzyme
Mol. Mass.:
49101.22
Organism:
Homo sapiens (Human)
Description:
Q9H7B4-2
Residue:
428
  
Inhibitor
Name:
BDBM293351
Synonyms:
N-((1r,4r)-4-(3- (benzylamino) propanamido) cyclohexyl)- 5-cyclopropylisoxazole- 3-carboxamide | US10106510, Compound 18
Type:
Small organic molecule
Emp. Form.:
C23H30N4O3
Mol. Mass.:
410.5093
SMILES:
O=C(CCNCc1ccccc1)N[C@H]1CC[C@@H](CC1)NC(=O)c1cc(on1)C1CC1
: