Target
Acetylcholinesterase
Ligand
BDBM293398
Substrate
Meas. Tech.
Measurement of IC50 of Eckol Derivatives Against Acetylcholinesterase and Butyrylcholinesterase
pH
7.4±n/a
Temperature
298.15±n/a K
IC50
34200±n/a nM
Comments
extracted
Citation
 Shin, HHwang, HPark, KYKim, SHLee, H Eckol derivatives, methods of synthesis and uses thereof US Patent  US10106521 Publication Date 10/23/2018 
Target
Name:
Acetylcholinesterase
Synonyms:
ACES_HUMAN Acetylcholinesterase (AChE) | Acetylcholinesterase (human AChE)
Type:
Enzyme
Mol. Mass.:
67792.70
Organism:
Homo sapiens (Human)
Description:
P22303
Residue:
614
  
Inhibitor
Name:
BDBM293398
Synonyms:
US10106521, Compound 9-O-Methyl Eckol
Type:
Small organic molecule
Emp. Form.:
C19H14O9
Mol. Mass.:
386.3091
SMILES:
COc1cc(O)cc2Oc3c(O)cc(O)c(Oc4cc(O)cc(O)c4)c3Oc12
: