Target
Acetylcholinesterase
Ligand
BDBM293404
Substrate
Meas. Tech.
Measurement of IC50 of Eckol Derivatives Against Acetylcholinesterase and Butyrylcholinesterase
pH
7.4±n/a
Temperature
298.15±n/a K
IC50
65600±n/a nM
Comments
extracted
Citation
 Shin, HHwang, HPark, KYKim, SHLee, H Eckol derivatives, methods of synthesis and uses thereof US Patent  US10106521 Publication Date 10/23/2018 
Target
Name:
Acetylcholinesterase
Synonyms:
ACES_HUMAN Acetylcholinesterase (AChE) | Acetylcholinesterase (human AChE)
Type:
Enzyme
Mol. Mass.:
67792.70
Organism:
Homo sapiens (Human)
Description:
P22303
Residue:
614
  
Inhibitor
Name:
BDBM293404
Synonyms:
US10106521, Compound 14-O-Methyl Phlorofucofuroeckol A
Type:
Small organic molecule
Emp. Form.:
C31H20O14
Mol. Mass.:
616.4821
SMILES:
COc1cc2oc3c(Oc4cc(O)cc(O)c4)c(O)cc(O)c3c2c2Oc3c(O)cc(O)c(Oc4cc(O)cc(O)c4)c3Oc12
: