Target
Dual specificity tyrosine-phosphorylation-regulated kinase 1A
Ligand
BDBM293569
Substrate
Meas. Tech.
The DYRK1A kinase assa
Temperature
298.15±n/a K
EC50
0.800±n/a nM
Comments
extracted
Citation
 KC, SKMak, CCEastman, BWCao, JBollu, VMittapalli, GKChiruta, C Isoquinolin-3-yl carboxamides and preparation and use thereof US Patent  US10106527 Publication Date 10/23/2018 
Target
Name:
Dual specificity tyrosine-phosphorylation-regulated kinase 1A
Synonyms:
DYR1A_HUMAN DYRK1A Dual specificity YAK1-related kinase 1A (Dyrk1A) Dual-specificity tyrosine-phosphorylation regulated kinase 1A HP86 MNBH
Type:
Enzyme
Mol. Mass.:
85616.61
Organism:
Homo sapiens (Human)
Description:
Q13627
Residue:
763
  
Inhibitor
Name:
BDBM293569
Synonyms:
US10106527, Compound 286 US11548872, Compound 286 US9951048, Compound 286
Type:
Small organic molecule
Emp. Form.:
C23H21N5O
Mol. Mass.:
383.4457
SMILES:
CN1Cc2ccc(cc2C1)C(=O)Nc1cc2cc(ccc2cn1)-c1cncn1C
: