Target
Muscarinic acetylcholine receptor M3
Ligand
BDBM103782
Substrate
Meas. Tech.
Radioligand Binding Assay
Temperature
310.15±n/a K
Ki
0.2±n/a nM
Comments
extracted
Citation
 Hughes, ADByun, DJacobsen, JR Diamide compounds having muscarinic receptor antagonist and BETA2 adrenergic receptor agonist activity US Patent  US9394275 Publication Date 7/19/2016 
Target
Name:
Muscarinic acetylcholine receptor M3
Synonyms:
ACM3_HUMAN Cholinergic, muscarinic M3 Muscarinic receptor M3 | RecName: Full=Muscarinic acetylcholine receptor M3
Type:
Enzyme
Mol. Mass.:
66151.03
Organism:
Homo sapiens (Human)
Description:
P20309
Residue:
590
  
Inhibitor
Name:
BDBM103782
Synonyms:
US8551978, I-52 US9394275, I-52 US9682957, I-52
Type:
Small organic molecule
Emp. Form.:
C50H54N6O7
Mol. Mass.:
850.9998
SMILES:
CC(Cc1cccc(CC(=O)Nc2cccc(c2)N(C)C(=O)CCN2CCC(CC2)OC(=O)Nc2ccccc2-c2ccccc2)c1)NC[C@H](O)c1ccc(O)c2[nH]c(=O)ccc12
: