Target
Mineralocorticoid receptor [729-984]
Ligand
BDBM238167
Substrate
Meas. Tech.
Binding Assay
pH
7.5±n/a
IC50
1600±n/a nM
Comments
extracted
Citation
 O'Mahony, GKossenjans, MEdman, KKajanus, JHogner, KACornwall, PTurner, A Benzoxazinone amides as mineralocorticoid receptor modulators US Patent  US9394291 Publication Date 7/19/2016 
Target
Name:
Mineralocorticoid receptor [729-984]
Synonyms:
MCR MLR Mineralocorticoid receptor(MR)( (T729-K985) | NR3C2
Type:
Enzyme
Mol. Mass.:
29747.25
Organism:
Homo sapiens (Human)
Description:
amino acids T729-K985
Residue:
256
  
Inhibitor
Name:
BDBM238167
Synonyms:
US10017502, Example 8 US9394291, 8a | US9394291, 8b
Type:
Small organic molecule
Emp. Form.:
C20H18BrN3O5
Mol. Mass.:
460.278
SMILES:
CNC(=O)CC1COc2cc(Br)ccc2N1C(=O)c1ccc2OCC(=O)Nc2c1
: