Target
Transient receptor potential cation channel subfamily V member 1
Ligand
BDBM238171
Substrate
Meas. Tech.
pH Assay
pH
7.4±n/a
Temperature
310.15±n/a K
IC50
45± 3.3 nM
Comments
extracted
Citation
 Yu, J TRPV1 antagonists including dihydroxy substituent and uses thereof US Patent  US9394293 Publication Date 7/19/2016 
Target
Name:
Transient receptor potential cation channel subfamily V member 1
Synonyms:
Capsaicin receptor Osm-9-like TRP channel 1 TRPV1_HUMAN Transient receptor potential cation channel subfamily V member 1 (TRPV1) Transient receptor potential cation channel subfamily V member 1(TRPV1) Vanilloid VR1 Vanilloid receptor 1 Vanilloid receptor 1 (VRI/TRPV1)
Type:
Protein
Mol. Mass.:
94960.75
Organism:
Homo sapiens (Human)
Description:
Q8NER1
Residue:
839
  
Inhibitor
Name:
BDBM238171
Synonyms:
US9394293, G155b
Type:
Small organic molecule
Emp. Form.:
C22H18FN3O3S
Mol. Mass.:
423.46
SMILES:
OC[C@@H](O)Cc1cnc(c(F)c1)-c1ccc(cc1)C(=O)Nc1nc2ccccc2s1
: